CI: test apkg install in libyang integration

Making sure every project installs in apkg CI images is currently too
much burden but `apkg install` should be tested and libyang provides
lightweight requirements so test `apkg install` during libyang
integration tests for now.
40 jobs for install in 35 minutes and 29 seconds (queued for 3 seconds)
Status Name Job ID Coverage
  Test
passed flake8 #564310

00:00:08

passed pylint #564311

00:00:17

passed self #564313

00:03:28

passed unit #564312

00:00:12

 
  Bird
passed centos-7-bird #564314

00:05:35

passed debian-10-bird #564317

00:10:54

passed debian-9-bird #564316

00:05:14

passed fedora-33-bird #564320

00:07:06

passed fedora-34-bird #564321

00:07:06

passed rocky-8-bird #564315

00:02:11

passed suse-15-bird #564322

00:02:59

passed ubuntu-18.04-bird #564318

00:03:18

passed ubuntu-20.04-bird #564319

00:11:01

 
  Libyang
passed centos-7-libyang #564323

00:03:35

passed debian-10-libyang #564326

00:08:08

passed debian-9-libyang #564325

00:01:17

passed fedora-33-libyang #564329

00:04:09

passed fedora-34-libyang #564330

00:04:15

passed rocky-8-libyang #564324

00:01:21

passed suse-15-libyang #564331

00:02:00

passed ubuntu-18.04-libyang #564327

00:00:42

passed ubuntu-20.04-libyang #564328

00:08:02

 
  Knot Dns
passed centos-7-knot-dns #564332

00:17:38

failed debian-10-knot-dns #564335

00:07:39

failed debian-9-knot-dns #564334

00:08:53

passed fedora-33-knot-dns #564338

00:12:53

passed fedora-34-knot-dns #564339

00:13:48

passed rocky-8-knot-dns #564333

00:07:49

passed suse-15-knot-dns #564340

00:09:34

failed ubuntu-18.04-knot-dns #564336

00:08:31

failed ubuntu-20.04-knot-dns #564337

00:14:36

 
  Knot Resolver
passed centos-7-knot-resolver #564341

00:13:24

passed debian-10-knot-resolver #565133

00:10:16

passed debian-9-knot-resolver #564343

00:03:19

passed fedora-33-knot-resolver #564346

00:05:51

passed fedora-34-knot-resolver #564347

00:06:08

passed rocky-8-knot-resolver #564342

00:02:39

passed suse-15-knot-resolver #564348

00:17:58

passed ubuntu-20.04-knot-resolver #564345

00:10:10

failed debian-10-knot-resolver #564344

00:07:38

 
Name Stage Failure
failed
ubuntu-18.04-knot-dns Knot Dns
make: *** [binary] Error 2
dpkg-buildpackage: error: debian/rules binary subprocess returned exit status 2
===================== 1 failed, 3 passed in 498.59 seconds =====================
Uploading artifacts for failed job
Uploading artifacts...
report.xml: found 1 matching files and directories

Uploading artifacts as "junit" to coordinator... ok
id=564336 responseStatus=201 Created token=9FqgLMge
Cleaning up file based variables
ERROR: Job failed: exit code 1
failed
debian-9-knot-dns Knot Dns
make: *** [binary] Error 2
dpkg-buildpackage: error: debian/rules binary gave error exit status 2
===================== 1 failed, 3 passed in 521.43 seconds =====================
Uploading artifacts for failed job
Uploading artifacts...
report.xml: found 1 matching files and directories

Uploading artifacts as "junit" to coordinator... ok
id=564334 responseStatus=201 Created token=s8sGQ8sk
Cleaning up file based variables
ERROR: Job failed: exit code 1
failed
ubuntu-20.04-knot-dns Knot Dns
                                 dpkg-buildpackage: error: debian/rules binary subprocess returned exit status 2
------------ generated xml file: /builds/packaging/apkg/report.xml -------------
===================== 1 failed, 3 passed in 425.05 seconds =====================
Uploading artifacts for failed job
Uploading artifacts...
report.xml: found 1 matching files and directories

Uploading artifacts as "junit" to coordinator... ok
id=564337 responseStatus=201 Created token=CERBLNv7
Cleaning up file based variables
ERROR: Job failed: exit code 1
failed
debian-10-knot-dns Knot Dns

-- Docs: https://docs.pytest.org/en/latest/warnings.html
===================== 3 warnings, 4 error in 8.73 seconds ======================
Uploading artifacts for failed job
Uploading artifacts...
report.xml: found 1 matching files and directories

Uploading artifacts as "junit" to coordinator... ok
id=564335 responseStatus=201 Created token=Wr9eKZJ1
Cleaning up file based variables
ERROR: Job failed: exit code 1