Update Foris JS to version 5.1.11

6 jobs for sentinel-options in 7 minutes and 58 seconds (queued for 5 seconds)
Status Job ID Name Coverage
  Test
failed #503797
lint

00:07:58

failed #503796
test

00:07:54

failed #501928
lint

00:03:56

failed #501491
lint

00:02:27

failed #501927
test

00:03:57

failed #501490
test

00:02:28

 
Name Stage Failure
failed
lint Test
2. remove package versions to allow pip attempt to solve the dependency conflict

ERROR: ResolutionImpossible: for help visit https://pip.pypa.io/en/latest/user_guide/#fixing-conflicting-dependencies
make[1]: *** [venv/bin/activate] Error 1
Makefile:43: recipe for target 'venv/bin/activate' failed
make[1]: Leaving directory '/builds/turris/reforis/reforis-data-collection'
make: *** [prepare-dev] Error 2
Makefile:55: recipe for target 'prepare-dev' failed
ERROR: Job failed: exit code 1
failed
test Test
2. remove package versions to allow pip attempt to solve the dependency conflict

ERROR: ResolutionImpossible: for help visit https://pip.pypa.io/en/latest/user_guide/#fixing-conflicting-dependencies
make[1]: *** [venv/bin/activate] Error 1
Makefile:43: recipe for target 'venv/bin/activate' failed
make[1]: Leaving directory '/builds/turris/reforis/reforis-data-collection'
Makefile:55: recipe for target 'prepare-dev' failed
make: *** [prepare-dev] Error 2
ERROR: Job failed: exit code 1