WIP

7 jobs for memory-download in 2 minutes and 39 seconds (queued for 7 seconds)
latest
Status Job ID Name Coverage
  Build
failed #357143
build-alpine

00:02:32

failed #357141
build-debian-stable

00:02:39

failed #357142
build-debian-unstable

00:02:30

 
  Test
skipped #357144
check
skipped #357146
lint-c
skipped #357147
lint-lua
skipped #357145
valgrind-memcheck
 
Name Stage Failure
failed
build-debian-stable Build
In file included from src/lib/uri.c:19:
src/lib/uri.h:138:7: note: previous declaration of 'uri_path' was here
char *uri_path(const Uri uri) __attribute__((nonnull));
^~~~~~~~
make: *** [Makefile:1464: src/lib/libupdater_la-uri.lo] Error 1
Uploading artifacts...
config.log: found 1 matching files
Uploading artifacts to coordinator... ok
id=357141 responseStatus=201 Created token=YySJHENF
ERROR: Job failed: exit code 1
failed
build-alpine Build
In file included from src/lib/uri.c:19:
src/lib/uri.h:138:7: note: previous declaration of 'uri_path' was here
138 | char *uri_path(const Uri uri) __attribute__((nonnull));
| ^~~~~~~~
make: *** [Makefile:1485: src/lib/libupdater_la-uri.lo] Error 1
Uploading artifacts...
config.log: found 1 matching files
Uploading artifacts to coordinator... ok
id=357143 responseStatus=201 Created token=w-FTDeF4
ERROR: Job failed: exit code 1
failed
build-debian-unstable Build
In file included from src/lib/uri.c:19:
src/lib/uri.h:138:7: note: previous declaration of 'uri_path' was here
138 | char *uri_path(const Uri uri) __attribute__((nonnull));
| ^~~~~~~~
make: *** [Makefile:1485: src/lib/libupdater_la-uri.lo] Error 1
Uploading artifacts...
config.log: found 1 matching files
Uploading artifacts to coordinator... ok
id=357142 responseStatus=201 Created token=K4tzHgHm
ERROR: Job failed: exit code 1