WIP

7 jobs for memory-download in 2 minutes and 39 seconds (queued for 7 seconds)
latest
Status Name Job ID Coverage
  Build
failed build-alpine #357143

00:02:32

failed build-debian-stable #357141

00:02:39

failed build-debian-unstable #357142

00:02:30

 
  Test
skipped check #357144
skipped lint-c #357146
skipped lint-lua #357147
skipped valgrind-memcheck #357145
 
Name Stage Failure
failed
build-alpine Build
In file included from src/lib/uri.c:19:
src/lib/uri.h:138:7: note: previous declaration of 'uri_path' was here
138 | char *uri_path(const Uri uri) __attribute__((nonnull));
| ^~~~~~~~
make: *** [Makefile:1485: src/lib/libupdater_la-uri.lo] Error 1
Uploading artifacts...
config.log: found 1 matching files
Uploading artifacts to coordinator... ok
id=357143 responseStatus=201 Created token=w-FTDeF4
ERROR: Job failed: exit code 1
failed
build-debian-unstable Build
In file included from src/lib/uri.c:19:
src/lib/uri.h:138:7: note: previous declaration of 'uri_path' was here
138 | char *uri_path(const Uri uri) __attribute__((nonnull));
| ^~~~~~~~
make: *** [Makefile:1485: src/lib/libupdater_la-uri.lo] Error 1
Uploading artifacts...
config.log: found 1 matching files
Uploading artifacts to coordinator... ok
id=357142 responseStatus=201 Created token=K4tzHgHm
ERROR: Job failed: exit code 1
failed
build-debian-stable Build
In file included from src/lib/uri.c:19:
src/lib/uri.h:138:7: note: previous declaration of 'uri_path' was here
char *uri_path(const Uri uri) __attribute__((nonnull));
^~~~~~~~
make: *** [Makefile:1464: src/lib/libupdater_la-uri.lo] Error 1
Uploading artifacts...
config.log: found 1 matching files
Uploading artifacts to coordinator... ok
id=357141 responseStatus=201 Created token=YySJHENF
ERROR: Job failed: exit code 1