WIP: Implement move and copy in C

7 jobs for c-copy-move in 45 seconds (queued for 5 seconds)
latest
Status Job ID Name Coverage
  Build
failed #463294
build-alpine

00:00:45

failed #463292
build-debian-stable

00:00:43

failed #463293
build-debian-unstable

00:00:42

 
  Test
skipped #463295
check
skipped #463297
lint-c
skipped #463298
lint-lua
skipped #463296
valgrind-memcheck
 
Name Stage Failure
failed
build-alpine Build
src/lib/path_utils.c:92:7: note: previous implicit declaration of 'is_dot_dotdot' was here
92 | if (is_dot_dotdot(ent->d_name))
| ^~~~~~~~~~~~~
make: *** [Makefile:1554: src/lib/libupdater_la-path_utils.lo] Error 1
Uploading artifacts for failed job
Uploading artifacts...
config.log: found 1 matching files and directories

Uploading artifacts as "archive" to coordinator... ok
id=463294 responseStatus=201 Created token=LGzfBxxx
ERROR: Job failed: exit code 1
failed
build-debian-stable Build
src/lib/path_utils.c:92:7: note: previous implicit declaration of 'is_dot_dotdot' was here
if (is_dot_dotdot(ent->d_name))
^~~~~~~~~~~~~
make: *** [Makefile:1533: src/lib/libupdater_la-path_utils.lo] Error 1
Uploading artifacts for failed job
Uploading artifacts...
config.log: found 1 matching files and directories

Uploading artifacts as "archive" to coordinator... ok
id=463292 responseStatus=201 Created token=WaQz1hLg
ERROR: Job failed: exit code 1
failed
build-debian-unstable Build
src/lib/path_utils.c:92:7: note: previous implicit declaration of 'is_dot_dotdot' was here
92 | if (is_dot_dotdot(ent->d_name))
| ^~~~~~~~~~~~~
make: *** [Makefile:1554: src/lib/libupdater_la-path_utils.lo] Error 1
Uploading artifacts for failed job
Uploading artifacts...
config.log: found 1 matching files and directories

Uploading artifacts as "archive" to coordinator... ok
id=463293 responseStatus=201 Created token=5KVtmQYv
ERROR: Job failed: exit code 1